Self-contained export — save this page or

checkout-service — Run #2 FAILED

main · flag default · commit a2c0de2 · 2026-06-15 11:28

Pass rate
75.0%
Tests
4
Passed
3
Failed
1
Skipped
0
Duration
0.5s
Line cov
75.0%
Quality gate FAILED

Failures (1)

FAILED com.checkout.PaymentTest#refund
expected: <true> but was: <false>
org.opentest4j.AssertionFailedError: expected: <true> but was: <false>

Suites

SuiteTestsFailures ErrorsSkippedTime
demo 4 1 0 0 0.50s

Coverage by file (most missed first)

FileLine % CoveredMissed
com/acme/service/PricingEngine.java 43.9%
90 115
com/acme/util/JsonMapper.java 74.9%
188 63
com/acme/web/ApiController.java 82.4%
248 53
com/acme/service/OrderService.java 91.8%
225 20