Self-contained export — save this page or

checkout-service — Run #3 FAILED

main · flag default · commit a3c0de3 · 2026-06-15 11:28

Pass rate
75.0%
Tests
4
Passed
3
Failed
1
Skipped
0
Duration
0.5s
Line cov
77.0%
Quality gate FAILED

Failures (1)

FAILED com.checkout.FlakyTest#sometimes
intermittent: timing
java.lang.AssertionError: intermittent: timing

Suites

SuiteTestsFailures ErrorsSkippedTime
demo 4 1 0 0 0.50s

Coverage by file (most missed first)

FileLine % CoveredMissed
com/acme/service/PricingEngine.java 46.5%
92 106
com/acme/util/JsonMapper.java 76.9%
193 58
com/acme/web/ApiController.java 84.1%
254 48
com/acme/service/OrderService.java 92.8%
231 18