UniTrack

Projects / checkout-service / Run #2

← Prev Next →

Run #2 FAILED Export ↗

main · flag default · a2c0de2 · 2026-06-15 11:28

75% pass
Tests
4
Passed
3
Failed
1
Skipped
0
Duration
0.5s
Line cov
75.0%
Quality gate FAILED
Regression vs baseline 1 new failure(s)
vs baseline run #1 on main — 1 new · 0 fixed · 0 still failing

Failures (1)

FAILED com.checkout.PaymentTest#refund — expected: <true> but was: <false> first failed: a2c0de2
org.opentest4j.AssertionFailedError: expected: <true> but was: <false>

Suites

SuiteTestsFailures ErrorsSkippedTime
demo 4 1 0 0 0.50s

Slowest tests (performance →)

TestDuration
com.checkout.CartTest › addItem 50 ms
com.checkout.PaymentTest › charge 50 ms
com.checkout.PaymentTest › refund 50 ms
com.checkout.CartTest › removeItem 50 ms

Coverage change vs baseline run #1 on main

+3.0 pp overall

FileBaselineThis runΔ pp
com/acme/service/OrderService.java improved 90.8% 91.8% +1.1
com/acme/web/ApiController.java improved 80.1% 82.4% +2.3
com/acme/util/JsonMapper.java improved 72.0% 74.9% +2.9
com/acme/service/PricingEngine.java improved 40.0% 43.9% +3.9

Coverage by module

ModuleLine %LinesFiles
service 70.0% 315/450 2
util 74.9% 188/251 1
web 82.4% 248/301 1

Coverage by file (most missed first)

FileLine %  CoveredMissed
com/acme/service/PricingEngine.java 43.9%
90 115
com/acme/util/JsonMapper.java 74.9%
188 63
com/acme/web/ApiController.java 82.4%
248 53
com/acme/service/OrderService.java 91.8%
225 20