UniTrack

Projects / checkout-service / Run #3

← Prev Next →

Run #3 FAILED Export ↗

main · flag default · a3c0de3 · 2026-06-15 11:28

75% pass
Tests
4
Passed
3
Failed
1
Skipped
0
Duration
0.5s
Line cov
77.0%
Quality gate FAILED
Regression vs baseline 1 new failure(s)
vs baseline run #2 on main — 1 new · 0 fixed · 0 still failing

Failures (1)

FAILED com.checkout.FlakyTest#sometimes — intermittent: timing first failed: a3c0de3
java.lang.AssertionError: intermittent: timing

Suites

SuiteTestsFailures ErrorsSkippedTime
demo 4 1 0 0 0.50s

Slowest tests (performance →)

TestDuration
com.checkout.CartTest › addItem 50 ms
com.checkout.PaymentTest › charge 50 ms
com.checkout.CartTest › removeItem 50 ms
com.checkout.FlakyTest › sometimes 50 ms

Coverage change vs baseline run #2 on main

+2.0 pp overall

FileBaselineThis runΔ pp
com/acme/service/OrderService.java improved 91.8% 92.8% +0.9
com/acme/web/ApiController.java improved 82.4% 84.1% +1.7
com/acme/util/JsonMapper.java improved 74.9% 76.9% +2.0
com/acme/service/PricingEngine.java improved 43.9% 46.5% +2.6

Coverage by module

ModuleLine %LinesFiles
service 72.3% 323/447 2
util 76.9% 193/251 1
web 84.1% 254/302 1

Coverage by file (most missed first)

FileLine %  CoveredMissed
com/acme/service/PricingEngine.java 46.5%
92 106
com/acme/util/JsonMapper.java 76.9%
193 58
com/acme/web/ApiController.java 84.1%
254 48
com/acme/service/OrderService.java 92.8%
231 18